[gmx-users] Re: Errors when compiling on OS X

Erik Lindahl lindahl at stanford.edu
Tue Jan 7 22:09:28 CET 2003

Hi Itamar,

This is a known bug in the Apple version of the gcc compiler. Download 
the prerelease
of 3.1.5 from ftp.gromacs.org/pub/beta and compile it instead!



Itamar Kass wrote:

>   I tried to installed gromacs-3.1.4 over a mac with OSX.2.  When running make
>I gut:
>./../include/ppc_altivec.h: In function `set_non_java_mode':
>./../include/ppc_altivec.h:60: argument 0 to built-in function `vec_splat_u32'
>does not satisfy constraint A
>make[3]: *** [fnbf.lo] Error 1
>make[2]: *** [all-recursive] Error 1
>make[1]: *** [all] Error 2
>make: *** [all-recursive] Error 1
>does someone know how to overcome it?  I used "bin/bash ./configure" at the
>begining.  I add the log file I produced from the make script.
>  Thanks, Kass.
>| Itamar Kass
>| The Alexander Silberman
>| Institute of Life Sciences
>| Department of Biological Chemistry
>| The Hebrew University, Givat-Ram
>| Jerusalem, 91904, Israel
>| Tel: +972-(0)2-6585146
>| Fax: +972-(0)2-6584329
>| Email: ikass at vms.huji.ac.il
>| Group Homepage: http://www.ls.huji.ac.il/~membranelab/

More information about the gromacs.org_gmx-users mailing list