[gmx-users] strange behavior upon compiling 4.0.4

Ken Rotondi ksr at chemistry.umass.edu
Thu Apr 16 21:11:19 CEST 2009

Hello all,

I'm trying to help a student build gromacs_4.0.4 on a MacBook Pro  
running 10.5. The program configures with out a hitch, but compiling  
with the make command ends in a recursive error. It seems that it's  
not finding something that it should have installed itself, but I  
wouldn't be surprised if I was wrong.

Any ideas?



mkdir .libs
rm -fr .libs/libnonbonded.lax
mkdir .libs/libnonbonded.lax
rm -fr .libs/libnonbonded.lax/libnb_kernel_ia32_sse.a
mkdir .libs/libnonbonded.lax/libnb_kernel_ia32_sse.a
Extracting /Users/jkoelmel/Desktop/college and IB/college/current
(cd .libs/libnonbonded.lax/libnb_kernel_ia32_sse.a && ar x
/Users/jkoelmel/Desktop/college and IB/college/current
ar: /Users/jkoelmel/Desktop/college: No such file or directory
make[5]: *** [libnonbonded.la] Error 1
make[4]: *** [all-recursive] Error 1
make[3]: *** [all-recursive] Error 1
make[2]: *** [all-recursive] Error 1
make[1]: *** [all] Error 2
make: *** [all-recursive] Error 1

Dr. KS Rotondi
The Departments of Chemistry & Biochemistry and Molecular Biology
The University of Massachusetts - Amherst
Amherst, MA 01075
ksr at chemistry.umass.edu

Phone:	413-545-1591
Fax:		413-545-4490

"If there's a solution, why worry? If there's no solution, why worry?"
	The Dali Lama

More information about the gromacs.org_gmx-users mailing list