[gmx-users] GMX 2018 regression tests: cufftPlanMany R2C plan failure (error code 5)

Alex nedomacho at gmail.com
Thu Feb 8 01:19:56 CET 2018

Update: we seem to have had a hiccup with an orphan CUDA install and that
was causing issues. After wiping everything off and rebuilding the errors
from the initial post disappeared. However, two tests failed during

95% tests passed, 2 tests failed out of 39

Label Time Summary:
GTest              = 170.83 sec (33 tests)
IntegrationTest    = 125.00 sec (3 tests)
MpiTest            =   4.90 sec (3 tests)
UnitTest           =  45.83 sec (30 tests)

Total Test time (real) = 1225.65 sec

The following tests FAILED:
  9 - GpuUtilsUnitTests (Timeout)
32 - MdrunTests (Timeout)
Errors while running CTest
CMakeFiles/run-ctest-nophys.dir/build.make:57: recipe for target
'CMakeFiles/run-ctest-nophys' failed
make[3]: *** [CMakeFiles/run-ctest-nophys] Error 8
CMakeFiles/Makefile2:1160: recipe for target
'CMakeFiles/run-ctest-nophys.dir/all' failed
make[2]: *** [CMakeFiles/run-ctest-nophys.dir/all] Error 2
CMakeFiles/Makefile2:971: recipe for target 'CMakeFiles/check.dir/rule'
make[1]: *** [CMakeFiles/check.dir/rule] Error 2
Makefile:546: recipe for target 'check' failed
make: *** [check] Error 2

Any ideas? I can post the complete log, if needed.

Thank you,


More information about the gromacs.org_gmx-users mailing list