[gmx-users] Error in GROMACS installtion in CYGWIN

raja raja_28 at fastmail.us
Thu Jan 19 10:12:48 CET 2006

Dear Gmaxion,
         This is the error I get when I install groamcs by make command
         in cygwin.
Please help me.

process_begin: CreateProcess(C:\Cygwin\bin\cc.exe, cc -DHAVE_CONFIG_H
-I. -I. -I
../../../../src -o mknb mknb.o mknb_metacode.o mknb_common.o
 mknb_outerloop.o mknb_innerloop.o mknb_interactions.o, ...) failed.
make (e=87): The parameter is incorrect.
C:\Cygwin\bin\make.exe[5]: *** [mknb] Error 87
C:\Cygwin\bin\make.exe[5]: Leaving directory
C:\Cygwin\bin\make.exe[4]: *** [all-recursive] Error 1
C:\Cygwin\bin\make.exe[4]: Leaving directory
C:\Cygwin\bin\make.exe[3]: *** [all-recursive] Error 1
C:\Cygwin\bin\make.exe[3]: Leaving directory `c:/gromacs-3.3/src/gmxlib'
make.exe[2]: *** [all-recursive] Error 1
make.exe[2]: Leaving directory `c:/gromacs-3.3/src'
C:\Cygwin\bin\make.exe[1]: *** [all] Error 2
C:\Cygwin\bin\make.exe[1]: Leaving directory `c:/gromacs-3.3/src'
C:\Cygwin\bin\make.exe: *** [all-recursive] Error 1

Thank you in advance !

  raja_28 at fastmail.us

http://www.fastmail.fm - Email service worth paying for. Try it for free

More information about the gromacs.org_gmx-users mailing list