[gmx-users] Help with Testset

b95203004 at ntu.edu.tw b95203004 at ntu.edu.tw
Tue Aug 11 05:13:54 CEST 2009

I have installed Gromacs without error, however, the testset result in:

FAILED. Check files in rb1
1 out of 16 simple tests FAILED
FAILED. Check files in dec+water
1 out of 14 complex tests FAILED

I do not worry about the dec+water, since it is explained in the  
testset, but I don't know what to do about rb1. No output is found.
What should I do??
It would be great if anyone can help me.

More information about the gromacs.org_gmx-users mailing list